Board index FlightGear Support Multiplayer

Error compiling fgms-0.9.11

Trouble getting online, setting up a server?
Forum rules
In order to help you, we need to know a lot of information. Make sure to include answers to at least the following questions in your initial post.

- what OS (Windows Xp/Vista, Mac etc.) are you running?
- what FlightGear version do you use?
- copy&paste your commandline.

Please, also see Requesting Technical Help.

Note: If you did not get a reponse, even after 7 days, you may want to check out the FlightGear mailing lists to ask your question there.

Error compiling fgms-0.9.11

Postby adrianborrego » Thu Jul 07, 2011 2:06 am

when I run make in the console receives this error. (I use Ubuntu 10.10)
Code: Select all
adriano@adriano:~/Descargas/fgms-0.9.11$ make
/usr/bin/make  all-recursive
make[1]: se ingresa al directorio «/home/adriano/Descargas/fgms-0.9.11»
Making all in src
make[2]: se ingresa al directorio «/home/adriano/Descargas/fgms-0.9.11/src»
Making all in simgear
make[3]: se ingresa al directorio «/home/adriano/Descargas/fgms-0.9.11/src/simgear»
Making all in debug
make[4]: se ingresa al directorio «/home/adriano/Descargas/fgms-0.9.11/src/simgear/debug»
if g++ -DHAVE_CONFIG_H -I. -I. -I../../.. -I../../.. -I../../../src    -Wall -MT logstream.o -MD -MP -MF ".deps/logstream.Tpo" -c -o logstream.o logstream.cxx; \
   then mv -f ".deps/logstream.Tpo" ".deps/logstream.Po"; else rm -f ".deps/logstream.Tpo"; exit 1; fi
In file included from logstream.cxx:23:
logstream.hxx: In member function ‘virtual int logbuf::overflow(int)’:
logstream.hxx:213: error: ‘EOF’ was not declared in this scope
logstream.cxx: In member function ‘std::string logstream::datestr()’:
logstream.cxx:110: error: ‘sprintf’ was not declared in this scope
make[4]: *** [logstream.o] Error 1
make[4]: se sale del directorio «/home/adriano/Descargas/fgms-0.9.11/src/simgear/debug»
make[3]: *** [all-recursive] Error 1
make[3]: se sale del directorio «/home/adriano/Descargas/fgms-0.9.11/src/simgear»
make[2]: *** [all-recursive] Error 1
make[2]: se sale del directorio «/home/adriano/Descargas/fgms-0.9.11/src»
make[1]: *** [all-recursive] Error 1
make[1]: se sale del directorio «/home/adriano/Descargas/fgms-0.9.11»
make: *** [all] Error 2
adrianborrego
 
Posts: 1
Joined: Thu Jul 07, 2011 1:50 am

Return to Multiplayer

Who is online

Users browsing this forum: No registered users and 1 guest